Target
Nitric oxide synthase, brain
Ligand
BDBM344410
Substrate
Meas. Tech.
Enzyme Assay
Ki
60.0±n/a nM
Citation
 Silverman, RBCinelli, MAPensa, AV 2-aminoquinoline-based compounds for potent and selective neuronal nitric oxide synthase inhibition US Patent  US9783500 Publication Date 10/10/2017 
Target
Name:
Nitric oxide synthase, brain
Synonyms:
Constitutive NOS NC-NOS NOS type I nNOS NOS1_HUMAN Neuronal nitric oxide synthase Nitric oxide synthase, neuronal (nNOS) bNOS | nNOS
Type:
Homodimer
Mol. Mass.:
160985.98
Organism:
Homo sapiens (Human)
Description:
P29475
Residue:
1434
  
Inhibitor
Name:
BDBM344410
Synonyms:
US9783500, Compound 18 | US9783500, Compound 6
Type:
Small organic molecule
Emp. Form.:
C17H18N4O
Mol. Mass.:
294.351
SMILES:
CNCc1cncc(OCc2ccc3ccc(N)nc3c2)c1
: