Target
Nitric oxide synthase, brain
Ligand
BDBM344426
Substrate
Meas. Tech.
Enzyme Assay
Ki
25600±n/a nM
Citation
 Silverman, RBCinelli, MAPensa, AV 2-aminoquinoline-based compounds for potent and selective neuronal nitric oxide synthase inhibition US Patent  US9783500 Publication Date 10/10/2017 
Target
Name:
Nitric oxide synthase, brain
Synonyms:
Constitutive NOS NC-NOS NOS1_MOUSE Nitric-oxide synthase, brain bNOS
Type:
PROTEIN
Mol. Mass.:
160483.95
Organism:
Mus musculus
Description:
ChEMBL_143499
Residue:
1429
  
Inhibitor
Name:
BDBM344426
Synonyms:
US9783500, Compound (S)-19
Type:
Small organic molecule
Emp. Form.:
C18H20N4O
Mol. Mass.:
308.3776
SMILES:
CN[C@@H](C)c1cncc(OCc2ccc3ccc(N)nc3c2)c1
: