Target
Sodium channel protein type 10 subunit alpha
Ligand
BDBM181161
Substrate
Meas. Tech.
Electrophysiology Assays
IC50
4.00±n/a nM
Citation
 Hadida-Ruah, SSAnderson, CArumugam, VAsgian, ILBear, BRTermin, APJohnson, JP Substituted quinolines as modulators of sodium channels US Patent  US9783501 Publication Date 10/10/2017 
Target
Name:
Sodium channel protein type 10 subunit alpha
Synonyms:
PN3 SCN10A Sodium channel alpha subunit Sodium channel protein type X alpha subunit fret-membrane potential nav1.8 | hPN3
Type:
Enzyme
Mol. Mass.:
220609.21
Organism:
Homo sapiens (Human)
Description:
Q9Y5Y9
Residue:
1956
  
Inhibitor
Name:
BDBM181161
Synonyms:
US9139529, 4 | US9783501, Compound 4
Type:
Small organic molecule
Emp. Form.:
C22H17ClN4O5S
Mol. Mass.:
484.912
SMILES:
COc1ccc(Oc2nc3ccccc3nc2C(=O)Nc2cccc(c2)S(N)(=O)=O)c(Cl)c1
: