Target
Sodium channel protein type 10 subunit alpha
Ligand
BDBM181189
Substrate
Meas. Tech.
Electrophysiology Assays
IC50
83.0±n/a nM
Citation
 Hadida-Ruah, SSAnderson, CArumugam, VAsgian, ILBear, BRTermin, APJohnson, JP Substituted quinolines as modulators of sodium channels US Patent  US9783501 Publication Date 10/10/2017 
Target
Name:
Sodium channel protein type 10 subunit alpha
Synonyms:
PN3 SCN10A Sodium channel alpha subunit Sodium channel protein type X alpha subunit fret-membrane potential nav1.8 | hPN3
Type:
Enzyme
Mol. Mass.:
220609.21
Organism:
Homo sapiens (Human)
Description:
Q9Y5Y9
Residue:
1956
  
Inhibitor
Name:
BDBM181189
Synonyms:
US9139529, 32 | US9783501, Compound 32
Type:
Small organic molecule
Emp. Form.:
C22H15FN4O5
Mol. Mass.:
434.3767
SMILES:
COc1cc(F)ccc1Oc1nc2ccccc2nc1C(=O)Nc1ccc(nc1)C(O)=O
: