Target
Sodium channel protein type 10 subunit alpha
Ligand
BDBM181230
Substrate
Meas. Tech.
Electrophysiology Assays
IC50
31.0±n/a nM
Citation
 Hadida-Ruah, SSAnderson, CArumugam, VAsgian, ILBear, BRTermin, APJohnson, JP Substituted quinolines as modulators of sodium channels US Patent  US9783501 Publication Date 10/10/2017 
Target
Name:
Sodium channel protein type 10 subunit alpha
Synonyms:
PN3 SCN10A Sodium channel alpha subunit Sodium channel protein type X alpha subunit fret-membrane potential nav1.8 | hPN3
Type:
Enzyme
Mol. Mass.:
220609.21
Organism:
Homo sapiens (Human)
Description:
Q9Y5Y9
Residue:
1956
  
Inhibitor
Name:
BDBM181230
Synonyms:
US9139529, 73 | US9783501, Compound 73
Type:
Small organic molecule
Emp. Form.:
C23H18ClN3O5S
Mol. Mass.:
483.924
SMILES:
COc1cc(Cl)ccc1Oc1nc2ccccc2cc1C(=O)Nc1cccc(c1)S(N)(=O)=O
: