Target
Sodium channel protein type 10 subunit alpha
Ligand
BDBM181236
Substrate
Meas. Tech.
Electrophysiology Assays
IC50
96.0±n/a nM
Citation
 Hadida-Ruah, SSAnderson, CArumugam, VAsgian, ILBear, BRTermin, APJohnson, JP Substituted quinolines as modulators of sodium channels US Patent  US9783501 Publication Date 10/10/2017 
Target
Name:
Sodium channel protein type 10 subunit alpha
Synonyms:
PN3 SCN10A Sodium channel alpha subunit Sodium channel protein type X alpha subunit fret-membrane potential nav1.8 | hPN3
Type:
Enzyme
Mol. Mass.:
220609.21
Organism:
Homo sapiens (Human)
Description:
Q9Y5Y9
Residue:
1956
  
Inhibitor
Name:
BDBM181236
Synonyms:
US9139529, 79 | US9783501, Compound 79
Type:
Small organic molecule
Emp. Form.:
C22H13ClFN3O4
Mol. Mass.:
437.808
SMILES:
OC(=O)c1ccc(NC(=O)c2cc3ccccc3nc2Oc2ccc(F)cc2Cl)cn1
: