Target
Nuclear receptor ROR-gamma
Ligand
BDBM344549
Substrate
Meas. Tech.
Biochemical TR-FRET Assay
IC50
5.44±n/a nM
Citation
 Aicher, TDVanHuis, CAMacLean, JAndresen, BMBarr, KJBienstock, CDaniels, MLiu, KLiu, YWhite, CSciammetta, NSimov, V Carbamate benzoxazine propionic acids and acid derivatives for modulation of RORgamma activity and the treatment of disease US Patent  US9783511 Publication Date 10/10/2017 
Target
Name:
Nuclear receptor ROR-gamma
Synonyms:
NR1F3 Nuclear receptor ROR-gamma (RORC) RAR-related orphan receptor C (RORc) RORG RZRG Retinoid-related orphan receptor-gamma (RORc)
Type:
Enzyme Catalytic Domain
Mol. Mass.:
58218.40
Organism:
Homo sapiens (Human)
Description:
P51449
Residue:
518
  
Inhibitor
Name:
BDBM344549
Synonyms:
(R or S)-3-((S)-4-((4-fluoro- 3-methylphenyl)sulfonyl)-6- ((((1,1,1-trifluoro-2- methylpropan-2- yl)oxy)carbonyl)amino)-3,4- dihydro-2H- benzo[b][1,4]oxazin-2-yl)-2- methylpropanoic acid | US9783511, 6CS
Type:
Small organic molecule
Emp. Form.:
C24H26F4N2O7S
Mol. Mass.:
562.531
SMILES:
C[C@H](C[C@H]1CN(c2cc(NC(=O)OC(C)(C)C(F)(F)F)ccc2O1)S(=O)(=O)c1ccc(F)c(C)c1)C(O)=O
: