Target
Epidermal growth factor receptor
Ligand
BDBM270542
Substrate
Meas. Tech.
Kinase Assay (EGFR)(T790M)
IC50
21.3±n/a nM
Citation
 Hu, SLiu, XBai, JLong, W Protein tyrosine kinase modulators and methods of use US Patent  US9783524 Publication Date 10/10/2017 
Target
Name:
Epidermal growth factor receptor
Synonyms:
EGF Receptor Substrate EGFR_HUMAN ERBB1 Epidermal Growth Factor Receptor erbB-1 Epidermal growth factor receptor (EGFR) HER1 Proto-oncogene c-ErbB-1 Tyrosine-Protein Kinase ErbB-1
Type:
Receptor Kinase Domain
Mol. Mass.:
134279.59
Organism:
Homo sapiens (Human)
Description:
P00533
Residue:
1210
  
Inhibitor
Name:
BDBM270542
Synonyms:
2-(2-(2-(4-acryloyl-3,4- dihydro-2H-benzo[b][1,4] oxazin-6-ylamino)-5- chloropyrimidin-4- ylamino)phenyl)-N,N- dimethyl-2-oxoacetamide US9783524, Example 87
Type:
Small organic molecule
Emp. Form.:
C25H23ClN6O4
Mol. Mass.:
506.941
SMILES:
CN(C)C(=O)C(=O)c1ccccc1Nc1nc(Nc2ccc3OCCN(C(=O)C=C)c3c2)ncc1Cl
: