Target
Epidermal growth factor receptor
Ligand
BDBM270544
Substrate
Meas. Tech.
Kinase Assay (EGFR)(T790M)
IC50
4.92±n/a nM
Citation
 Hu, SLiu, XBai, JLong, W Protein tyrosine kinase modulators and methods of use US Patent  US9783524 Publication Date 10/10/2017 
Target
Name:
Epidermal growth factor receptor
Synonyms:
EGF Receptor Substrate EGFR_HUMAN ERBB1 Epidermal Growth Factor Receptor erbB-1 Epidermal growth factor receptor (EGFR) HER1 Proto-oncogene c-ErbB-1 Tyrosine-Protein Kinase ErbB-1
Type:
Receptor Kinase Domain
Mol. Mass.:
134279.59
Organism:
Homo sapiens (Human)
Description:
P00533
Residue:
1210
  
Inhibitor
Name:
BDBM270544
Synonyms:
2-(2-(5-chloro-2-(4-(4- (dimethylamino)piperidin- 1-yl)-3-methoxyphenylamino) pyrimidin-4-ylamino)phenyl)- N,N-dimethyl-2-oxoacetamide US9783524, Example 118
Type:
Small organic molecule
Emp. Form.:
C28H34ClN7O3
Mol. Mass.:
552.068
SMILES:
COc1cc(Nc2ncc(Cl)c(Nc3ccccc3C(=O)C(=O)N(C)C)n2)ccc1N1CCC(CC1)N(C)C
: