Target
Sodium channel protein type 9 subunit alpha
Ligand
BDBM344709
Substrate
Meas. Tech.
FLIPR Assay
IC50
483±n/a nM
Citation
 Daanen, JFDeGoey, DAFrost, JMKoenig, JRLatshaw, SMatulenko, MScanio, MShi, LBunnelle, WH Indazole ureas and method of use US Patent  US9783527 Publication Date 10/10/2017 
Target
Name:
Sodium channel protein type 9 subunit alpha
Synonyms:
NENA Peripheral sodium channel 1 SCN9A_HUMAN Voltage-gated sodium channel subunit Nav1.7 hNE-Na
Type:
Protein
Mol. Mass.:
226375.97
Organism:
Homo sapiens (Human)
Description:
Q15858
Residue:
1988
  
Inhibitor
Name:
BDBM344709
Synonyms:
1-[1-(2-fluorophenyl)-1H-indazol-4-yl]-3-{2-[(3S)-3-fluoropyrrolidin-1-yl]-2-oxoethyl}-1,3-dihydro-2H-imidazol-2-one | US9783527, Example 11
Type:
Small organic molecule
Emp. Form.:
C22H19F2N5O3
Mol. Mass.:
439.4148
SMILES:
F[C@H]1CCN(C1)C(=O)CN1CC(=O)N(C1=O)c1cccc2n(ncc12)-c1ccccc1F
: