Target
Sodium channel protein type 10 subunit alpha
Ligand
BDBM344724
Substrate
Meas. Tech.
FLIPR Assay
IC50
517±n/a nM
Citation
 Daanen, JFDeGoey, DAFrost, JMKoenig, JRLatshaw, SMatulenko, MScanio, MShi, LBunnelle, WH Indazole ureas and method of use US Patent  US9783527 Publication Date 10/10/2017 
Target
Name:
Sodium channel protein type 10 subunit alpha
Synonyms:
PN3 SCN10A Sodium channel alpha subunit Sodium channel protein type X alpha subunit fret-membrane potential nav1.8 | hPN3
Type:
Enzyme
Mol. Mass.:
220609.21
Organism:
Homo sapiens (Human)
Description:
Q9Y5Y9
Residue:
1956
  
Inhibitor
Name:
BDBM344724
Synonyms:
1-[1-(2-fluorophenyl)-1H-indazol-4-yl]-3-(1,3-oxazol-4-ylmethyl)imidazolidin-2-one | US9783527, Example 26
Type:
Small organic molecule
Emp. Form.:
C20H16FN5O2
Mol. Mass.:
377.3717
SMILES:
Fc1ccccc1-n1ncc2c(cccc12)N1CCN(Cc2cocn2)C1=O
: