Target
Sodium channel protein type 9 subunit alpha
Ligand
BDBM344737
Substrate
Meas. Tech.
FLIPR Assay
IC50
301±n/a nM
Citation
 Daanen, JFDeGoey, DAFrost, JMKoenig, JRLatshaw, SMatulenko, MScanio, MShi, LBunnelle, WH Indazole ureas and method of use US Patent  US9783527 Publication Date 10/10/2017 
Target
Name:
Sodium channel protein type 9 subunit alpha
Synonyms:
NENA Peripheral sodium channel 1 SCN9A_HUMAN Voltage-gated sodium channel subunit Nav1.7 hNE-Na
Type:
Protein
Mol. Mass.:
226375.97
Organism:
Homo sapiens (Human)
Description:
Q15858
Residue:
1988
  
Inhibitor
Name:
BDBM344737
Synonyms:
1-[1-(2-fluorophenyl)-1H-indazol-4-yl]-3-(1,3-thiazol-4-ylmethyl)imidazolidin-2-one | US9783527, Example 39
Type:
Small organic molecule
Emp. Form.:
C20H16FN5OS
Mol. Mass.:
393.437
SMILES:
Fc1ccccc1-n1ncc2c(cccc12)N1CCN(Cc2cscn2)C1=O
: