Target
Beta-secretase 1
Ligand
BDBM204938
Substrate
Meas. Tech.
BACE1 Inhibiting Activity
pH
5±n/a
Temperature
303.15±n/a K
IC50
96.8±0.0 nM
Comments
extracted
Citation
 Kusakabe, KYoshida, SNakahara, KHasegawa, TTadano, GFuchino, K Dihydrooxazine or oxazepine derivatives having BACE1 inhibitory activity US Patent  US9540359 Publication Date 1/10/2017 
Target
Name:
Beta-secretase 1
Synonyms:
ASP2 Aspartyl protease 2 BACE1 Beta-secretase (BACE) Beta-secretase 1 (BACE 1) Beta-secretase 1 (BACE1) Beta-site amyloid precursor protein cleaving enzyme 1 Memapsin-2 beta-Secretase (BACE-1) | beta-Secretase (BACE1)
Type:
Protein
Mol. Mass.:
55755.10
Organism:
Homo sapiens (Human)
Description:
P56817
Residue:
501
  
Inhibitor
Name:
BDBM204938
Synonyms:
I-14
Type:
Small organic molecule
Emp. Form.:
C18H13FN6O2
Mol. Mass.:
364.3332
SMILES:
NC1=N[C@](CCO1)(C#N)c1cc(NC(=O)c2ccc(cn2)C#N)ccc1F
: