Target
Serine/threonine-protein kinase Chk1
Ligand
BDBM14611
Substrate
Cdc25C peptide substrate
Meas. Tech.
Chk1 Enzymatic Assay
pH
7.4±n/a
Temperature
295.15±n/a K
IC50
23±n/a nM
Citation
 Li, GHasvold, LATao, ZFWang, GTGwaltney, SLPatel, JKovar, PCredo, RBChen, ZZhang, HPark, CSham, HLSowin, TRosenberg, SHLin, NH Synthesis and biological evaluation of 1-(2,4,5-trisubstituted phenyl)-3-(5-cyanopyrazin-2-yl)ureas as potent Chk1 kinase inhibitors. Bioorg Med Chem Lett 16:2293-8 (2006)  
Target
Name:
Serine/threonine-protein kinase Chk1
Synonyms:
CHEK1 CHK1 checkpoint homolog Checkpoint kinase-1 (CHK1)
Type:
Enzyme Catalytic Domain
Mol. Mass.:
54443.02
Organism:
Homo sapiens (Human)
Description:
gi_166295192
Residue:
476
  
Inhibitor
Name:
BDBM14611
Synonyms:
N-pyrazinylurea Analog 8f | methyl 7-[(2-chloro-4-{[(5-cyanopyrazin-2-yl)carbamoyl]amino}-5-methoxyphenyl)carbamoyl]heptanoate
Type:
Small organic molecule
Emp. Form.:
C22H25ClN6O5
Mol. Mass.:
488.924
SMILES:
COC(=O)CCCCCCC(=O)Nc1cc(OC)c(NC(=O)Nc2cnc(cn2)C#N)cc1Cl
:
Substrate
Name:
Cdc25C peptide substrate
Synonyms:
Type:
Peptide
Mol. Mass.:
2519.88
Organism:
Description:
Cdc25c peptide substrate contained a sequence of amino acid residues 204-225 of human phosphatase Cdc25C.
Residue:
22