Target
Coagulation factor XI
Ligand
BDBM345057
Substrate
Meas. Tech.
Factor XIa Assay
IC50
0.160±n/a nM
Citation
 Liu, WEdmondson, SDGuo, ZMertz, EOgawa, AKSo, SSun, WBrockunier, LLAli, AKuang, RWu, H Factor Xla inhibitors US Patent  US9783530 Publication Date 10/10/2017 
Target
Name:
Coagulation factor XI
Synonyms:
Coagulation factor XIa Coagulation factor XIa light chain FA11_HUMAN Factor XIa PTA | Plasma thromboplastin antecedent
Type:
Enzyme
Mol. Mass.:
70130.58
Organism:
Homo sapiens (Human)
Description:
P03951
Residue:
625
  
Inhibitor
Name:
BDBM345057
Synonyms:
4-{[(2R)-2-{5-[5-chloro- 2-(1H-tetrazol-1- yl)phenyl]-1- oxidopyridin-2-yl}-3- phenylpropanoyl]amino} benzoic acid | US9783530, 2
Type:
Small organic molecule
Emp. Form.:
C28H21ClN6O4
Mol. Mass.:
540.957
SMILES:
OC(=O)c1ccc(NC(=O)[C@H](Cc2ccccc2)c2ccc(c[n+]2[O-])-c2cc(Cl)ccc2-n2cnnn2)cc1
: