Target
Coagulation factor XI
Ligand
BDBM345060
Substrate
Meas. Tech.
Factor XIa Assay
IC50
109±n/a nM
Citation
 Liu, WEdmondson, SDGuo, ZMertz, EOgawa, AKSo, SSun, WBrockunier, LLAli, AKuang, RWu, H Factor Xla inhibitors US Patent  US9783530 Publication Date 10/10/2017 
Target
Name:
Coagulation factor XI
Synonyms:
Coagulation factor XIa Coagulation factor XIa light chain FA11_HUMAN Factor XIa PTA | Plasma thromboplastin antecedent
Type:
Enzyme
Mol. Mass.:
70130.58
Organism:
Homo sapiens (Human)
Description:
P03951
Residue:
625
  
Inhibitor
Name:
BDBM345060
Synonyms:
2-[5-(3-chloro-2,6- difluorophenyl)-1- oxidopyridin-2-yl]-N- 1H-indazol-6-yl-3- phenylpropanamide | US9783530, 5
Type:
Small organic molecule
Emp. Form.:
C27H20ClF2N4O
Mol. Mass.:
489.923
SMILES:
Fc1ccc(Cl)c(F)c1-c1ccc([nH+]c1)C(Cc1ccccc1)C(=O)Nc1ccc2cn[nH]c2c1
: