Target
Coagulation factor XI
Ligand
BDBM345064
Substrate
Meas. Tech.
Factor XIa Assay
IC50
89.2±n/a nM
Citation
 Liu, WEdmondson, SDGuo, ZMertz, EOgawa, AKSo, SSun, WBrockunier, LLAli, AKuang, RWu, H Factor Xla inhibitors US Patent  US9783530 Publication Date 10/10/2017 
Target
Name:
Coagulation factor XI
Synonyms:
Coagulation factor XIa Coagulation factor XIa light chain FA11_HUMAN Factor XIa PTA | Plasma thromboplastin antecedent
Type:
Enzyme
Mol. Mass.:
70130.58
Organism:
Homo sapiens (Human)
Description:
P03951
Residue:
625
  
Inhibitor
Name:
BDBM345064
Synonyms:
4-({[5-(3-chloro-2,6- difluorophenyl)-1- oxidopyridin-2- yl]acetyl}amino) benzoic acid | US9783530, 9
Type:
Small organic molecule
Emp. Form.:
C20H13ClF2N2O4
Mol. Mass.:
418.778
SMILES:
OC(=O)c1ccc(NC(=O)Cc2ccc(c[n+]2[O-])-c2c(F)ccc(Cl)c2F)cc1
: