Target
Kallikrein-1
Ligand
BDBM345069
Substrate
Meas. Tech.
Kallikrein Assay
IC50
1352±n/a nM
Citation
 Liu, WEdmondson, SDGuo, ZMertz, EOgawa, AKSo, SSun, WBrockunier, LLAli, AKuang, RWu, H Factor Xla inhibitors US Patent  US9783530 Publication Date 10/10/2017 
Target
Name:
Kallikrein-1
Synonyms:
KLK1 Kallikrein 1 Kidney/pancreas/salivary gland kallikrein | Tissue kallikrein
Type:
Enzyme
Mol. Mass.:
28874.69
Organism:
Homo sapiens (Human)
Description:
P06870
Residue:
262
  
Inhibitor
Name:
BDBM345069
Synonyms:
4-[({5-[5-chloro-2-(1H- tetrazol-1-yl)phenyl]-1- oxidopyridin-2- yl}acetyl)amino] benzoic acid | US9783530, 14
Type:
Small organic molecule
Emp. Form.:
C21H16ClN6O3
Mol. Mass.:
435.843
SMILES:
OC(=O)c1ccc(NC(=O)Cc2ccc(c[nH+]2)-c2cc(Cl)ccc2-n2cnnn2)cc1
: