Target
Kallikrein-1
Ligand
BDBM345074
Substrate
Meas. Tech.
Kallikrein Assay
IC50
9.20±n/a nM
Citation
 Liu, WEdmondson, SDGuo, ZMertz, EOgawa, AKSo, SSun, WBrockunier, LLAli, AKuang, RWu, H Factor Xla inhibitors US Patent  US9783530 Publication Date 10/10/2017 
Target
Name:
Kallikrein-1
Synonyms:
KLK1 Kallikrein 1 Kidney/pancreas/salivary gland kallikrein | Tissue kallikrein
Type:
Enzyme
Mol. Mass.:
28874.69
Organism:
Homo sapiens (Human)
Description:
P06870
Residue:
262
  
Inhibitor
Name:
BDBM345074
Synonyms:
US9783530, 19 methyl {4-[(2-{5-[5- chloro-2-(1H-tetrazol-1- yl)phenyl]-1- oxidopyridin-2-yl}-3- phenylpropanoyl)amino] bicyclo[2.2.2]oct-1- yl}carbamate
Type:
Small organic molecule
Emp. Form.:
C31H33ClN7O3
Mol. Mass.:
587.091
SMILES:
COC(=O)NC12CCC(CC1)(CC2)NC(=O)C(Cc1ccccc1)c1ccc(c[nH+]1)-c1cc(Cl)ccc1-n1cnnn1
: