Target
Kallikrein-1
Ligand
BDBM345082
Substrate
Meas. Tech.
Kallikrein Assay
IC50
23.8±n/a nM
Citation
 Liu, WEdmondson, SDGuo, ZMertz, EOgawa, AKSo, SSun, WBrockunier, LLAli, AKuang, RWu, H Factor Xla inhibitors US Patent  US9783530 Publication Date 10/10/2017 
Target
Name:
Kallikrein-1
Synonyms:
KLK1 Kallikrein 1 Kidney/pancreas/salivary gland kallikrein | Tissue kallikrein
Type:
Enzyme
Mol. Mass.:
28874.69
Organism:
Homo sapiens (Human)
Description:
P06870
Residue:
262
  
Inhibitor
Name:
BDBM345082
Synonyms:
4-{[(2R)-2-{5-[5-chloro-2- (1H-tetrazol-1-yl)phenyl]- 1-oxidopyridin-2-yl}-3- cyclopropylpropanoyl] amino}benzoic acid | US9783530, 27
Type:
Small organic molecule
Emp. Form.:
C25H21ClN6O4
Mol. Mass.:
504.925
SMILES:
OC(=O)c1ccc(NC(=O)[C@H](CC2CC2)c2ccc(c[n+]2[O-])-c2cc(Cl)ccc2-n2cnnn2)cc1
: