Target
Coagulation factor XI
Ligand
BDBM345084
Substrate
Meas. Tech.
Factor XIa Assay
IC50
458±n/a nM
Citation
 Liu, WEdmondson, SDGuo, ZMertz, EOgawa, AKSo, SSun, WBrockunier, LLAli, AKuang, RWu, H Factor Xla inhibitors US Patent  US9783530 Publication Date 10/10/2017 
Target
Name:
Coagulation factor XI
Synonyms:
Coagulation factor XIa Coagulation factor XIa light chain FA11_HUMAN Factor XIa PTA | Plasma thromboplastin antecedent
Type:
Enzyme
Mol. Mass.:
70130.58
Organism:
Homo sapiens (Human)
Description:
P03951
Residue:
625
  
Inhibitor
Name:
BDBM345084
Synonyms:
4-({2-[5-(3-chloro-6- cyano-2-fluorophenyl)-1- oxidopyridin-2-yl]-3- cyclopropylpropanoyl} amino)benzoic acid US9783530, 30
Type:
Small organic molecule
Emp. Form.:
C25H19ClFN3O4
Mol. Mass.:
479.887
SMILES:
OC(=O)c1ccc(NC(=O)C(CC2CC2)c2ccc(c[n+]2[O-])-c2c(F)c(Cl)ccc2C#N)cc1
: