Target
Kallikrein-1
Ligand
BDBM345084
Substrate
Meas. Tech.
Kallikrein Assay
IC50
80.4±n/a nM
Citation
 Liu, WEdmondson, SDGuo, ZMertz, EOgawa, AKSo, SSun, WBrockunier, LLAli, AKuang, RWu, H Factor Xla inhibitors US Patent  US9783530 Publication Date 10/10/2017 
Target
Name:
Kallikrein-1
Synonyms:
KLK1 Kallikrein 1 Kidney/pancreas/salivary gland kallikrein | Tissue kallikrein
Type:
Enzyme
Mol. Mass.:
28874.69
Organism:
Homo sapiens (Human)
Description:
P06870
Residue:
262
  
Inhibitor
Name:
BDBM345084
Synonyms:
4-({2-[5-(3-chloro-6- cyano-2-fluorophenyl)-1- oxidopyridin-2-yl]-3- cyclopropylpropanoyl} amino)benzoic acid US9783530, 30
Type:
Small organic molecule
Emp. Form.:
C25H19ClFN3O4
Mol. Mass.:
479.887
SMILES:
OC(=O)c1ccc(NC(=O)C(CC2CC2)c2ccc(c[n+]2[O-])-c2c(F)c(Cl)ccc2C#N)cc1
: