Target
Coagulation factor XI
Ligand
BDBM345089
Substrate
Meas. Tech.
Factor XIa Assay
IC50
443±n/a nM
Citation
 Liu, WEdmondson, SDGuo, ZMertz, EOgawa, AKSo, SSun, WBrockunier, LLAli, AKuang, RWu, H Factor Xla inhibitors US Patent  US9783530 Publication Date 10/10/2017 
Target
Name:
Coagulation factor XI
Synonyms:
Coagulation factor XIa Coagulation factor XIa light chain FA11_HUMAN Factor XIa PTA | Plasma thromboplastin antecedent
Type:
Enzyme
Mol. Mass.:
70130.58
Organism:
Homo sapiens (Human)
Description:
P03951
Residue:
625
  
Inhibitor
Name:
BDBM345089
Synonyms:
4-[(2-{5-[5-chloro-2-(1,3- oxazol-5-yl)phenyl]-1- oxidopyridin-2-yl}-3- cyclopropylpropanoyl) amino]benzoic acid US9783530, 35
Type:
Small organic molecule
Emp. Form.:
C27H22ClN3O5
Mol. Mass.:
503.934
SMILES:
OC(=O)c1ccc(NC(=O)C(CC2CC2)c2ccc(c[n+]2[O-])-c2cc(Cl)ccc2-c2cnco2)cc1
: