Target
Kallikrein-1
Ligand
BDBM345096
Substrate
Meas. Tech.
Kallikrein Assay
IC50
363±n/a nM
Citation
 Liu, WEdmondson, SDGuo, ZMertz, EOgawa, AKSo, SSun, WBrockunier, LLAli, AKuang, RWu, H Factor Xla inhibitors US Patent  US9783530 Publication Date 10/10/2017 
Target
Name:
Kallikrein-1
Synonyms:
KLK1 Kallikrein 1 Kidney/pancreas/salivary gland kallikrein | Tissue kallikrein
Type:
Enzyme
Mol. Mass.:
28874.69
Organism:
Homo sapiens (Human)
Description:
P06870
Residue:
262
  
Inhibitor
Name:
BDBM345096
Synonyms:
4-{[2-(5-{5-chloro-2-[4- (difluoromethyl)-1H-1,2,3- triazol-1-yl]phenyl}-1- oxidopyridin-2-yl)-3- cyclopropylpropanoyl] amino}benzoic acid US9783530, 51 | US9783530, 52
Type:
Small organic molecule
Emp. Form.:
C27H22ClF2N5O4
Mol. Mass.:
553.944
SMILES:
OC(=O)c1ccc(NC(=O)C(CC2CC2)c2ccc(c[n+]2[O-])-c2cc(Cl)ccc2-n2cc(nn2)C(F)F)cc1
: