Target
Coagulation factor XI
Ligand
BDBM345108
Substrate
Meas. Tech.
Factor XIa Assay
IC50
4.70±n/a nM
Citation
 Liu, WEdmondson, SDGuo, ZMertz, EOgawa, AKSo, SSun, WBrockunier, LLAli, AKuang, RWu, H Factor Xla inhibitors US Patent  US9783530 Publication Date 10/10/2017 
Target
Name:
Coagulation factor XI
Synonyms:
Coagulation factor XIa Coagulation factor XIa light chain FA11_HUMAN Factor XIa PTA | Plasma thromboplastin antecedent
Type:
Enzyme
Mol. Mass.:
70130.58
Organism:
Homo sapiens (Human)
Description:
P03951
Residue:
625
  
Inhibitor
Name:
BDBM345108
Synonyms:
4-[(2-{5-[5-chloro-2-(1H- 1,2,3-triazol-1-yl)phenyl]- 1-oxidopyridin-2-yl}-3- cyclopropylpropanoyl) amino]benzoic acid | US9783530, 54
Type:
Small organic molecule
Emp. Form.:
C26H23ClN5O3
Mol. Mass.:
488.945
SMILES:
OC(=O)c1ccc(NC(=O)C(CC2CC2)c2ccc(c[nH+]2)-c2cc(Cl)ccc2-n2ccnn2)cc1
: