Target
MAP kinase-interacting serine/threonine-protein kinase 1
Ligand
BDBM214644
Substrate
Meas. Tech.
Kinase Assay
IC50
64.0±n/a nM
Citation
 Zorn, LEis, KSchulze, VSülzle, DPuehler, FLienau, PBömer, UPetersen, KHägebarth, A Aminoimidazopyridazines US Patent  US9783543 Publication Date 10/10/2017 
Target
Name:
MAP kinase-interacting serine/threonine-protein kinase 1
Synonyms:
MAP Kinase-Interacting Protein Kinase (MNK1) MAP kinase-interacting serine/threonine-protein kinase 1 (MnK1) MAP-kinase interacting kinase 1 (MNK1) MKNK1 MNK1
Type:
Serine/threonine-protein kinase
Mol. Mass.:
51342.85
Organism:
Homo sapiens (Human)
Description:
Q9BUB5
Residue:
465
  
Inhibitor
Name:
BDBM214644
Synonyms:
US9284319, R2 US9783543, R2
Type:
Small organic molecule
Emp. Form.:
C17H13N5
Mol. Mass.:
287.3186
SMILES:
N(c1ccccc1)c1ccc2ncc(-c3ccncc3)n2n1
: