Target
Serine/threonine-protein kinase Chk1
Ligand
BDBM14664
Substrate
Cdc25C peptide substrate
Meas. Tech.
Chk1 Enzymatic Assay
pH
7.4±n/a
Temperature
295.15±n/a K
IC50
4±n/a nM
Citation
 Lin, NHXia, PKovar, PPark, CChen, ZZhang, HRosenberg, SHSham, HL Synthesis and biological evaluation of 3-ethylidene-1,3-dihydro-indol-2-ones as novel checkpoint 1 inhibitors. Bioorg Med Chem Lett 16:421-6 (2006)  
Target
Name:
Serine/threonine-protein kinase Chk1
Synonyms:
CHEK1 CHK1 checkpoint homolog Checkpoint kinase-1 (CHK1)
Type:
Enzyme Catalytic Domain
Mol. Mass.:
54443.02
Organism:
Homo sapiens (Human)
Description:
gi_166295192
Residue:
476
  
Inhibitor
Name:
BDBM14664
Synonyms:
(3Z)-6-(4-hydroxy-3-methoxyphenyl)-3-{1H-pyrrolo[2,3-b]pyridin-3-ylmethylidene}-2,3-dihydro-1H-indol-2-one | indolinone analog 28
Type:
Small organic molecule
Emp. Form.:
C23H17N3O3
Mol. Mass.:
383.3994
SMILES:
COc1cc(ccc1O)-c1ccc2C(=Cc3c[nH]c4ncccc34)C(=O)Nc2c1
:
Substrate
Name:
Cdc25C peptide substrate
Synonyms:
Type:
Peptide
Mol. Mass.:
2519.88
Organism:
Description:
Cdc25c peptide substrate contained a sequence of amino acid residues 204-225 of human phosphatase Cdc25C.
Residue:
22