Target
Prothrombin
Ligand
BDBM14714
Substrate
BDBM13573
Meas. Tech.
Serine Protease Inhibition Assay
pH
7.8±n/a
Temperature
295.15±n/a K
Ki
3600±n/a nM
Citation
 Olivero, AGEigenbrot, CGoldsmith, RRobarge, KArtis, DRFlygare, JRawson, TSutherlin, DPKadkhodayan, SBeresini, MElliott, LODeGuzman, GGBanner, DWUltsch, MMarzec, UHanson, SRRefino, CBunting, SKirchhofer, D A selective, slow binding inhibitor of factor VIIa binds to a nonstandard active site conformation and attenuates thrombus formation in vivo. J Biol Chem 280:9160-9 (2005)  
Target
Name:
Prothrombin
Synonyms:
Activation peptide fragment 1 Coagulation factor II Prothrombin precursor Thrombin heavy chain | Thrombin light chain
Type:
Protein
Mol. Mass.:
70029.57
Organism:
Homo sapiens (Human)
Description:
P00734
Residue:
622
  
Inhibitor
Name:
BDBM14714
Synonyms:
(2R)-N-[(3-aminobenzene)sulfonyl]-2-[(4-carbamimidoyl-3-hydroxyphenyl)amino]-2-(3,5-diethoxy-2-fluorophenyl)acetamide R-4-[2-(3-aminobenzenesulfonylamino)-1-(3,5-diethoxy-2-fluorophenyl)-2-oxoethylamino]-2-hydroxy-benzamidine.TFA
Type:
Small organic molecule
Emp. Form.:
C25H28FN5O6S
Mol. Mass.:
545.583
SMILES:
CCOc1cc(OCC)c(F)c(c1)[C@@H](Nc1ccc(C(N)=N)c(O)c1)C(=O)NS(=O)(=O)c1cccc(N)c1
:
Substrate
Name:
BDBM13573
Synonyms:
(2S)-5-carbamimidamido-N-(4-nitrophenyl)-2-{[(2S)-1-{[(2S)-5-oxopyrrolidin-2-yl]carbonyl}pyrrolidin-2-yl]formamido}pentanamide hydrochloride Glu-Pro-Arg-pNA L-Pyroglutamyl-L-prolyl-L-arginine-p-Nitroaniline S-2366
Type:
Small organic molecule
Emp. Form.:
C22H30N8O6
Mol. Mass.:
502.5236
SMILES:
[#7]\[#6](-[#7])=[#7]/[#6]-[#6]-[#6]-[#6@H](-[#7]-[#6](=O)-[#6@@H]-1-[#6]-[#6]-[#6]-[#7]-1-[#6](=O)-[#6@@H]-1-[#6]-[#6]-[#6](=O)-[#7]-1)-[#6](=O)-[#7]-c1ccc(cc1)-[#7+](-[#8-])=O
: