Target
Nuclear receptor coactivator 2 [740-753]
Ligand
BDBM205035
Substrate
Meas. Tech.
Homogeneous Time-Resolved Fluorescence (HTRF) assay
IC50
<500±0 nM
Citation
 Xiao, DLi, JZhu, YHu, YWang, HWang, ZWang, ZWei, YSun, YWu, QZhang, HPeng, YKong, FSun, YLuo, HHan, Y Kinase modulating compounds, compositions containing the same and use thereof US Patent  US9550781 Publication Date 1/24/2017 
Target
Name:
Nuclear receptor coactivator 2 [740-753]
Synonyms:
BHLHE75 NCOA2 Nuclear receptor coactivator 2 (aa 740-753) SRC2-3 peptide | TIF2
Type:
fluorescent labeled peptide
Mol. Mass.:
1704.90
Organism:
Description:
Q15596 aa 740-753
Residue:
14
KENALLRYLLDKDD
 
Inhibitor
Name:
BDBM205035
Synonyms:
US9550781, 25 | n-(3-(3-(1h-pyrazolo[3,4-d]pyrimidin-4-yl)pyridin-2-ylamino)-2,4-difluorophenyl)propane-1-sulfonamide
Type:
Small organic molecule
Emp. Form.:
C19H17F2N7O2S
Mol. Mass.:
445.446
SMILES:
CCCS(=O)(=O)Nc1ccc(F)c(Nc2ncccc2-c2ncnc3[nH]ncc23)c1F
: