Target
Nuclear receptor coactivator 2 [740-753]
Ligand
BDBM205040
Substrate
Meas. Tech.
Homogeneous Time-Resolved Fluorescence (HTRF) assay
IC50
<100.0±0 nM
Citation
 Xiao, DLi, JZhu, YHu, YWang, HWang, ZWang, ZWei, YSun, YWu, QZhang, HPeng, YKong, FSun, YLuo, HHan, Y Kinase modulating compounds, compositions containing the same and use thereof US Patent  US9550781 Publication Date 1/24/2017 
Target
Name:
Nuclear receptor coactivator 2 [740-753]
Synonyms:
BHLHE75 NCOA2 Nuclear receptor coactivator 2 (aa 740-753) SRC2-3 peptide | TIF2
Type:
fluorescent labeled peptide
Mol. Mass.:
1704.90
Organism:
Description:
Q15596 aa 740-753
Residue:
14
KENALLRYLLDKDD
 
Inhibitor
Name:
BDBM205040
Synonyms:
US9550781, 27 | n-(3-(2-(9h-purin-6-yl)phenylamino)-4-methylphenyl)propane-1-sulfonamide
Type:
Small organic molecule
Emp. Form.:
C21H22N6O2S
Mol. Mass.:
422.503
SMILES:
CCCS(=O)(=O)Nc1ccc(C)c(Nc2ccccc2-c2ncnc3[nH]cnc23)c1
: