Target
Baculoviral IAP repeat-containing protein 3/E3 ubiquitin-protein ligase XIAP
Ligand
BDBM50030275
Substrate
Meas. Tech.
Fluorescence Polarization Assay (FPA)
IC50
130±n/a nM
Citation
 Borzilleri, RMKim, KSPerez, HLStang, EMWilliams, DKZhang, L IAP antagonists US Patent  US9783573 Publication Date 10/10/2017 
Target
Name:
Baculoviral IAP repeat-containing protein 3/E3 ubiquitin-protein ligase XIAP
Synonyms:
XIAP BIR3 XIAP-BIR31
Type:
Protein
Mol. Mass.:
Description:
Components:
This complex has 2 components.
Component 1
Name:
E3 ubiquitin-protein ligase XIAP
Synonyms:
API3 E3 ubiquitin-protein ligase XIAP Inhibitor of apoptosis protein 3 X-linked inhibitor of apoptosis XIAP | XIAP_HUMAN
Type:
Protein
Mol. Mass.:
56685.27
Organism:
Homo sapiens (Human)
Description:
P98170
Residue:
497
  
Component 2
Name:
Baculoviral IAP repeat-containing protein 3
Synonyms:
API2 BIRC3_HUMAN Baculoviral IAP repeat-containing protein 3 (IAP1 BIR3) MIHC XIAP-BIR3 | cIAP1/cIAP2
Type:
Protein
Mol. Mass.:
68365.75
Organism:
Homo sapiens (Human)
Description:
Q13489
Residue:
604
  
Inhibitor
Name:
BDBM50030275
Synonyms:
CHEMBL3339216 | US9783573, Example 44
Type:
Small organic molecule
Emp. Form.:
C64H81N9O7
Mol. Mass.:
1088.384
SMILES:
CN[C@@H](C)C(=O)N[C@H](C(=O)N1C[C@H](C[C@H]1C(=O)N[C@@H]1CCCc2ccccc12)NC(=O)c1ccc(cc1)C#Cc1ccc2C[C@H](N(Cc2c1)C(=O)[C@@H](NC(=O)[C@H](C)NC)C(C)(C)C)C(=O)N[C@@H]1CCCc2ccccc12)C(C)(C)C
: