Target
Baculoviral IAP repeat-containing protein 2/E3 ubiquitin-protein ligase XIAP
Ligand
BDBM50030275
Substrate
Meas. Tech.
AlphaScreen Assay
IC50
740±n/a nM
Citation
 Borzilleri, RMKim, KSPerez, HLStang, EMWilliams, DKZhang, L IAP antagonists US Patent  US9783573 Publication Date 10/10/2017 
Target
Name:
Baculoviral IAP repeat-containing protein 2/E3 ubiquitin-protein ligase XIAP
Synonyms:
XIAP BIR2-3 | XIAP-BIR2
Type:
Protein
Mol. Mass.:
Description:
Components:
This complex has 2 components.
Component 1
Name:
E3 ubiquitin-protein ligase XIAP
Synonyms:
API3 E3 ubiquitin-protein ligase XIAP Inhibitor of apoptosis protein 3 X-linked inhibitor of apoptosis XIAP | XIAP_HUMAN
Type:
Protein
Mol. Mass.:
56685.27
Organism:
Homo sapiens (Human)
Description:
P98170
Residue:
497
  
Component 2
Name:
Baculoviral IAP repeat-containing protein 2
Synonyms:
API1 BIRC2_HUMAN Cellular inhibitor of apoptosis 1 MIHB | RNF48
Type:
Protein
Mol. Mass.:
69900.47
Organism:
Homo sapiens (Human)
Description:
Q13490
Residue:
618
  
Inhibitor
Name:
BDBM50030275
Synonyms:
CHEMBL3339216 | US9783573, Example 44
Type:
Small organic molecule
Emp. Form.:
C64H81N9O7
Mol. Mass.:
1088.384
SMILES:
CN[C@@H](C)C(=O)N[C@H](C(=O)N1C[C@H](C[C@H]1C(=O)N[C@@H]1CCCc2ccccc12)NC(=O)c1ccc(cc1)C#Cc1ccc2C[C@H](N(Cc2c1)C(=O)[C@@H](NC(=O)[C@H](C)NC)C(C)(C)C)C(=O)N[C@@H]1CCCc2ccccc12)C(C)(C)C
: