Target
Baculoviral IAP repeat-containing protein 3/E3 ubiquitin-protein ligase XIAP
Ligand
BDBM345202
Substrate
Meas. Tech.
Fluorescence Polarization Assay (FPA)
IC50
42.0±n/a nM
Citation
 Borzilleri, RMKim, KSPerez, HLStang, EMWilliams, DKZhang, L IAP antagonists US Patent  US9783573 Publication Date 10/10/2017 
Target
Name:
Baculoviral IAP repeat-containing protein 3/E3 ubiquitin-protein ligase XIAP
Synonyms:
XIAP BIR3 XIAP-BIR31
Type:
Protein
Mol. Mass.:
Description:
Components:
This complex has 2 components.
Component 1
Name:
E3 ubiquitin-protein ligase XIAP
Synonyms:
API3 E3 ubiquitin-protein ligase XIAP Inhibitor of apoptosis protein 3 X-linked inhibitor of apoptosis XIAP | XIAP_HUMAN
Type:
Protein
Mol. Mass.:
56685.27
Organism:
Homo sapiens (Human)
Description:
P98170
Residue:
497
  
Component 2
Name:
Baculoviral IAP repeat-containing protein 3
Synonyms:
API2 BIRC3_HUMAN Baculoviral IAP repeat-containing protein 3 (IAP1 BIR3) MIHC XIAP-BIR3 | cIAP1/cIAP2
Type:
Protein
Mol. Mass.:
68365.75
Organism:
Homo sapiens (Human)
Description:
Q13489
Residue:
604
  
Inhibitor
Name:
BDBM345202
Synonyms:
(S)-2-((S)-3,3-Dimethyl-2-((S)-2- (methylamino)propanamido) butanoyl)-7-(3-((((3S,5S)-1-((S)-3,3- dimethyl-2-((S)-2-(methylamino) propanamido)butanoyl)-5-(((R)- 1,2,3,4-tetrahydronaphthalen-1- yl)carbamoyl)pyrrolidin-3- yl)oxy)methyl)benzamido)-N-((R)- 1,2,3,4-tetrahydronaphthalen-1-yl)- 1,2,3,4-tetrahydroisoquinoline-3- carboxamide | US9783573, Example 52
Type:
Small organic molecule
Emp. Form.:
C63H83N9O8
Mol. Mass.:
1094.3886
SMILES:
CN[C@@H](C)C(=O)N[C@H](C(=O)N1C[C@H](C[C@H]1C(=O)N[C@@H]1CCCc2ccccc12)OCc1cccc(c1)C(=O)Nc1ccc2C[C@H](N(Cc2c1)C(=O)[C@@H](NC(=O)[C@H](C)NC)C(C)(C)C)C(=O)N[C@@H]1CCCc2ccccc12)C(C)(C)C
: