Target
Monocarboxylate transporter 4
Ligand
BDBM345258
Substrate
Meas. Tech.
Assay 2: MCT4-Mediated Lactate Transport in NCI-H358 Lung Adenocarcinoma Cells
IC50
54.0±n/a nM
Citation
 Parnell, KMMcCall, J MCT4 inhibitors for treating disease US Patent  US10202350 Publication Date 2/12/2019 
Target
Name:
Monocarboxylate transporter 4
Synonyms:
MCT 4 MCT4 SLC16A3 | Solute carrier family 16 member 3
Type:
PROTEIN
Mol. Mass.:
49474.36
Organism:
Homo sapiens (Human)
Description:
ChEMBL_104604
Residue:
465
  
Inhibitor
Name:
BDBM345258
Synonyms:
2-[[1-[(2-Chlorophenyl)methyl]-5-(4- fluorophenyl)pyrazol-3-yl]methoxy]-2- methyl-propanoic acid 1H NMR (CD3OD, 400 MHz) $#948; 1.51 (s, 6H), 4.58 (s, 2H), 5.40 (s, 2H), 6.55 (s, 1H), 6.70-6.78 (m, 1H), 7.14-7.18 (m, 2H), 7-20- 7.29 (m, 2H), 7.32-7.40 (m, 3H). US10214492, Example 4 US11724989, Example 4
Type:
Small organic molecule
Emp. Form.:
C21H20ClFN2O3
Mol. Mass.:
402.847
SMILES:
CC(C)(OCc1cc(-c2ccc(F)cc2)n(Cc2ccccc2Cl)n1)C(O)=O
: