Target
Monocarboxylate transporter 4
Ligand
BDBM345259
Substrate
Meas. Tech.
Lactate Transport in MCT4-Expressing MDA-MB-453 Breast Cancer Cells
IC50
160±n/a nM
Citation
 Parnell, KMMcCall, J MCT4 inhibitors for treating disease US Patent  US10202350 Publication Date 2/12/2019 
Target
Name:
Monocarboxylate transporter 4
Synonyms:
MCT 4 MCT4 SLC16A3 | Solute carrier family 16 member 3
Type:
PROTEIN
Mol. Mass.:
49474.36
Organism:
Homo sapiens (Human)
Description:
ChEMBL_104604
Residue:
465
  
Inhibitor
Name:
BDBM345259
Synonyms:
2-[[5-(4-Chlorophenyl)-1-[(2,4- dichlorophenyl)methyl]pyrazol-3- yl]methoxy]-2-methyl-propanoic acid 1H NMR (CD3OD, 400 MHz) $#948; 1.48 (s, 6H), 4.58 (s, 2H), 5.40 (s, 2H), 6.54 (s, 1H), 6.73 (d, 1H), 7.20-7.38 (m, 3H), 7.40-48 (m, 3H). US10214492, Example 5 US11724989, Example 5
Type:
Small organic molecule
Emp. Form.:
C21H19Cl3N2O3
Mol. Mass.:
453.746
SMILES:
CC(C)(OCc1cc(-c2ccc(Cl)cc2)n(Cc2ccc(Cl)cc2Cl)n1)C(O)=O
: