Target
Monocarboxylate transporter 4
Ligand
BDBM345285
Substrate
Meas. Tech.
Assay 3: MCT4-Mediated Lactate Transport in MDA-MB-231 Breast Cancer Cells
IC50
53.0±n/a nM
Citation
 Parnell, KMMcCall, J MCT4 inhibitors for treating disease US Patent  US10202350 Publication Date 2/12/2019 
Target
Name:
Monocarboxylate transporter 4
Synonyms:
MCT 4 MCT4 SLC16A3 | Solute carrier family 16 member 3
Type:
PROTEIN
Mol. Mass.:
49474.36
Organism:
Homo sapiens (Human)
Description:
ChEMBL_104604
Residue:
465
  
Inhibitor
Name:
BDBM345285
Synonyms:
2-[[1-[(2-Isopropylphenyl)methyl]-5-(3- methoxyphenyl)pyrazol-3-yl]methoxy]-2- methyl-propanoic acid. 1HNMR (CDCl3): $#948; 1.13 (s, 3H), 1.15 (s, 3H), 1.55 (s 6H), 2.94-2.97 (m, 1H), 3.62 (s, 3H), 4.63 (s, 2H), 5.42 (s, 2H), 6.39 (s, 1H), 6.65-6.67 (m, 1H), 6.75-6.76 (m, 1H), 6.85-6.91 (m, 2H), 7.07-7.11 (m, 1H), 7.21-7.28 (m, 3H) US10214492, Example 31 US11724989, Example 31
Type:
Small organic molecule
Emp. Form.:
C25H30N2O4
Mol. Mass.:
422.5167
SMILES:
COc1cccc(c1)-c1cc(COC(C)(C)C(O)=O)nn1Cc1ccccc1C(C)C
: