Target
Malignant T-cell-amplified sequence 1
Ligand
BDBM345297
Substrate
Meas. Tech.
Assay 4: MCT1-Mediated Lactate Transport in BT20 Breast Cancer Cells
IC50
33000±n/a nM
Citation
 Parnell, KMMcCall, J MCT4 inhibitors for treating disease US Patent  US10202350 Publication Date 2/12/2019 
Target
Name:
Malignant T-cell-amplified sequence 1
Synonyms:
MCT-1 MCTS1 Multiple copies T-cell malignancies
Type:
Enzyme Catalytic Domain
Mol. Mass.:
20563.62
Organism:
Homo sapiens (human)
Description:
Residue:
181
  
Inhibitor
Name:
BDBM345297
Synonyms:
2-[[1-[(2-Chlorophenyl)methyl]-5-[3- (2,2,2-trifluoroethoxy)phenyl]pyrazol-3- yl]methoxy]-2-methyl-propanoic acid. 1HNMR (CDCl3): $#948; 1.55 (s, 6H), 4.16 (q, 2H), 4.63 (s, 2H), 5.42 (s, 2H), 6.43 (s, 1H), 6.77-6.81 (m, 2H), 6.96-6.98 (m, 2H), 7.19- 7.36 (m, 4H). US10214492, Example 43 US11724989, Example 43
Type:
Small organic molecule
Emp. Form.:
C23H22ClF3N2O4
Mol. Mass.:
482.88
SMILES:
CC(C)(OCc1cc(-c2cccc(OCC(F)(F)F)c2)n(Cc2ccccc2Cl)n1)C(O)=O
: