Target
CREB-binding protein
Ligand
BDBM345586
Substrate
Meas. Tech.
In Vitro Enzyme Inhibition Assay-CREBBP Inhibition
IC50
<500±n/a nM
Citation
 Bennett, MJBetancort, JMBoloor, AKanouni, TStafford, JAVeal, JMWallace, MB Therapeutic compounds US Patent  US10202360 Publication Date 2/12/2019 
Target
Name:
CREB-binding protein
Synonyms:
CBP CREB-binding protein (CBP) CREBBP
Type:
Transcription Coactivator
Mol. Mass.:
265411.66
Organism:
Homo sapiens (Human)
Description:
Q92793
Residue:
2442
  
Inhibitor
Name:
BDBM345586
Synonyms:
Ethanesulfonic acid [2- cyclopentyloxy-6-(1,5-dimethyl-6- oxo-1,6-dihydro-pyridin-3-yl)- pyrimidin-4-yl]-amide | US10202360, Example 131
Type:
Small organic molecule
Emp. Form.:
C18H24N4O4S
Mol. Mass.:
392.473
SMILES:
CCS(=O)(=O)Nc1cc(nc(OC2CCCC2)n1)-c1cc(C)c(=O)n(C)c1
: