Target
CREB-binding protein
Ligand
BDBM345740
Substrate
Meas. Tech.
In Vitro Enzyme Inhibition Assay-CREBBP Inhibition
IC50
<500±n/a nM
Citation
 Bennett, MJBetancort, JMBoloor, AKanouni, TStafford, JAVeal, JMWallace, MB Therapeutic compounds US Patent  US10202360 Publication Date 2/12/2019 
Target
Name:
CREB-binding protein
Synonyms:
CBP CREB-binding protein (CBP) CREBBP
Type:
Transcription Coactivator
Mol. Mass.:
265411.66
Organism:
Homo sapiens (Human)
Description:
Q92793
Residue:
2442
  
Inhibitor
Name:
BDBM345740
Synonyms:
5-(6-(cyclopentylamino)-2-(2- fluoro-6-methylphenoxy)pyrimidin- 4-yl)-1-methylpyridin-2(1H)-one | US10202360, Example 285
Type:
Small organic molecule
Emp. Form.:
C22H23FN4O2
Mol. Mass.:
394.442
SMILES:
Cc1cccc(F)c1Oc1nc(NC2CCCC2)cc(n1)-c1ccc(=O)n(C)c1
: