Target
CREB-binding protein
Ligand
BDBM349279
Substrate
Meas. Tech.
CBP TR-FRET Binding Assay
IC50
46.0±n/a nM
Citation
 Romero, FAMagnuson, SRPastor, RTsui, VHMurray, JCrawford, TBurdick, DJAlbrecht, BKCote, ATaylor, AMNasveschuck, CGLeBlanc, YHewitt, MCLai, KWChen, K Therapeutic compounds and uses thereof US Patent  US10206931 Publication Date 2/19/2019 
Target
Name:
CREB-binding protein
Synonyms:
CBP CREB-binding protein (CBP) CREBBP
Type:
Transcription Coactivator
Mol. Mass.:
265411.66
Organism:
Homo sapiens (Human)
Description:
Q92793
Residue:
2442
  
Inhibitor
Name:
BDBM349279
Synonyms:
(2R)-9-(3-cyclopropyl-1-methyl-indazol-5-yl)-6-methoxy-2-methyl-1,2,3,5-tetrahydro-1,5-benzodiazepin-4-one | US10206931, Example 86
Type:
Small organic molecule
Emp. Form.:
C22H26N4O2
Mol. Mass.:
378.4674
SMILES:
CNc1ccc(cc1C(=N)C1CC1)-c1ccc(OC)c2NC(=O)C[C@@H](C)Nc12
: