Target
CREB-binding protein
Ligand
BDBM50178163
Substrate
Meas. Tech.
CBP TR-FRET Binding Assay
IC50
45.0±n/a nM
Citation
 Romero, FAMagnuson, SRPastor, RTsui, VHMurray, JCrawford, TBurdick, DJAlbrecht, BKCote, ATaylor, AMNasveschuck, CGLeBlanc, YHewitt, MCLai, KWChen, K Therapeutic compounds and uses thereof US Patent  US10206931 Publication Date 2/19/2019 
Target
Name:
CREB-binding protein
Synonyms:
CBP CREB-binding protein (CBP) CREBBP
Type:
Transcription Coactivator
Mol. Mass.:
265411.66
Organism:
Homo sapiens (Human)
Description:
Q92793
Residue:
2442
  
Inhibitor
Name:
BDBM50178163
Synonyms:
CHEMBL3813846 | US10206931, Example 286
Type:
Small organic molecule
Emp. Form.:
C23H22N2O2
Mol. Mass.:
358.433
SMILES:
C[C@@H]1CC(=O)Nc2cccc(-c3cccc(OCc4ccccc4)c3)c2N1
: