Target
Sigma intracellular receptor 2
Ligand
BDBM349307
Substrate
Meas. Tech.
Competitive Radioligand Binding Assay 2
Ki
2.20±n/a nM
Citation
 Rishton, GMCatalano, SMLook, GC Isoindoline compositions and methods for treating neurodegenerative disease US Patent  US10207991 Publication Date 2/19/2019 
Target
Name:
Sigma intracellular receptor 2
Synonyms:
MAC30 S2R Sigma-2 receptor TMEM97 | Transmembrane protein 97
Type:
Protein
Mol. Mass.:
20857.20
Organism:
Homo sapiens (Human)
Description:
Q5BJF2
Residue:
176
  
Inhibitor
Name:
BDBM349307
Synonyms:
US10207991, Ex. Cpd. No. 4 US11691947, Example 4
Type:
Small organic molecule
Emp. Form.:
C19H18Cl2F3N
Mol. Mass.:
388.254
SMILES:
C[C@H](CCc1ccc(Cl)c(Cl)c1)N1Cc2ccc(cc2C1)C(F)(F)F
: