Target
Sigma non-opioid intracellular receptor 1
Ligand
BDBM349533
Substrate
Meas. Tech.
Competitive Radioligand Binding Assay 2
Ki
470±n/a nM
Citation
 Rishton, GMCatalano, SMLook, GC Isoindoline compositions and methods for treating neurodegenerative disease US Patent  US10207991 Publication Date 2/19/2019 
Target
Name:
Sigma non-opioid intracellular receptor 1
Synonyms:
Aging-associated gene 8 protein SGMR1_HUMAN SIGMAR1 SR31747-binding protein Sigma 1-type opioid receptor Sigma1R | hSigmaR1
Type:
Enzyme Catalytic Domain
Mol. Mass.:
25124.85
Organism:
Homo sapiens (Human)
Description:
Q99720
Residue:
223
  
Inhibitor
Name:
BDBM349533
Synonyms:
US10207991, Ex. Cpd. No. 49 US11691947, Example 49
Type:
Small organic molecule
Emp. Form.:
C23H29FN2O3
Mol. Mass.:
400.4864
SMILES:
COc1cc(CCC(C)(C)N2Cc3cccc(F)c3C2)ccc1OC(=O)N(C)C
: