Target
Sigma non-opioid intracellular receptor 1
Ligand
BDBM349539
Substrate
Meas. Tech.
Competitive Radioligand Binding Assay 2
Ki
360±n/a nM
Citation
 Rishton, GMCatalano, SMLook, GC Isoindoline compositions and methods for treating neurodegenerative disease US Patent  US10207991 Publication Date 2/19/2019 
Target
Name:
Sigma non-opioid intracellular receptor 1
Synonyms:
Aging-associated gene 8 protein SGMR1_HUMAN SIGMAR1 SR31747-binding protein Sigma 1-type opioid receptor Sigma1R | hSigmaR1
Type:
Enzyme Catalytic Domain
Mol. Mass.:
25124.85
Organism:
Homo sapiens (Human)
Description:
Q99720
Residue:
223
  
Inhibitor
Name:
BDBM349539
Synonyms:
US10207991, Ex. Cpd. No. 55 US11691947, Example 55
Type:
Small organic molecule
Emp. Form.:
C20H20F5NO2
Mol. Mass.:
401.3703
SMILES:
CC(C)(CCc1ccc(O)c(OC(F)(F)F)c1)N1Cc2c(C1)c(F)ccc2F
: