Target
Sigma intracellular receptor 2
Ligand
BDBM349554
Substrate
Meas. Tech.
Competitive Radioligand Binding Assay 2
Ki
76.0±n/a nM
Citation
 Rishton, GMCatalano, SMLook, GC Isoindoline compositions and methods for treating neurodegenerative disease US Patent  US10207991 Publication Date 2/19/2019 
Target
Name:
Sigma intracellular receptor 2
Synonyms:
MAC30 S2R Sigma-2 receptor TMEM97 | Transmembrane protein 97
Type:
Protein
Mol. Mass.:
20857.20
Organism:
Homo sapiens (Human)
Description:
Q5BJF2
Residue:
176
  
Inhibitor
Name:
BDBM349554
Synonyms:
US10207991, Ex. Cpd. No. 69 US11691947, Example 69
Type:
Small organic molecule
Emp. Form.:
C22H29NO4S
Mol. Mass.:
403.535
SMILES:
CC(C)Oc1cc(CC[C@@H](C)N2Cc3ccc(cc3C2)S(C)(=O)=O)ccc1O
: