Target
Sigma intracellular receptor 2
Ligand
BDBM349568
Substrate
Meas. Tech.
Competitive Radioligand Binding Assay 2
Ki
10000±n/a nM
Citation
 Rishton, GMCatalano, SMLook, GC Isoindoline compositions and methods for treating neurodegenerative disease US Patent  US10207991 Publication Date 2/19/2019 
Target
Name:
Sigma intracellular receptor 2
Synonyms:
MAC30 S2R Sigma-2 receptor TMEM97 | Transmembrane protein 97
Type:
Protein
Mol. Mass.:
20857.20
Organism:
Homo sapiens (Human)
Description:
Q5BJF2
Residue:
176
  
Inhibitor
Name:
BDBM349568
Synonyms:
US10207991, Ex. Cpd. No. 86 US11691947, Example 86
Type:
Small organic molecule
Emp. Form.:
C25H34N2O4
Mol. Mass.:
426.5485
SMILES:
COCCN(C)C(=O)c1cccc2CN(Cc12)C(C)(C)CCc1ccc(O)c(OC)c1
: