Target
Proto-oncogene tyrosine-protein kinase receptor Ret [V804L]
Ligand
BDBM345827
Substrate
Meas. Tech.
RET V804L Gatekeeper Mutant Assay at KM
IC50
55±n/a nM
Citation
 Brooijmans, NDiPietro, LVFleming, PEKim, JLWenglowsky, SMZhang, Y 2-(pyridin-3-yl)-pyrimidine derivatives as RET inhibitors US Patent  US10202365 Publication Date 2/12/2019 
Target
Name:
Proto-oncogene tyrosine-protein kinase receptor Ret [V804L]
Synonyms:
CDHF12 PTC RET kinase (V804L) RET51 | RET_HUMAN
Type:
Enzyme Catalytic Domain
Mol. Mass.:
124332.32
Organism:
Homo sapiens (Human)
Description:
P07949[V804L]
Residue:
1114
  
Inhibitor
Name:
BDBM345827
Synonyms:
US10202365, Compound 4 | US10774070, Compound 4
Type:
Small organic molecule
Emp. Form.:
C23H21N7O
Mol. Mass.:
411.4591
SMILES:
Cc1cc(Nc2cc(C)nc(n2)-c2ccc(nc2)C(=O)N2Cc3ccccc3C2)n[nH]1
: