Target
Proto-oncogene tyrosine-protein kinase receptor Ret
Ligand
BDBM345832
Substrate
Meas. Tech.
RET Wild Type Assay at KM
IC50
55±n/a nM
Citation
 Brooijmans, NDiPietro, LVFleming, PEKim, JLWenglowsky, SMZhang, Y 2-(pyridin-3-yl)-pyrimidine derivatives as RET inhibitors US Patent  US10202365 Publication Date 2/12/2019 
Target
Name:
Proto-oncogene tyrosine-protein kinase receptor Ret
Synonyms:
CDHF12 Cadherin family member 12 Proto-oncogene c-Ret RET51 Tyrosine-protein kinase Ret (RET)
Type:
Protein
Mol. Mass.:
124318.29
Organism:
Homo sapiens (Human)
Description:
P07949
Residue:
1114
  
Inhibitor
Name:
BDBM345832
Synonyms:
US10202365, Compound 9 | US10774070, Compound 9
Type:
Small organic molecule
Emp. Form.:
C22H20FN7O
Mol. Mass.:
417.4389
SMILES:
Cc1cc(Nc2cc(C)nc(n2)-c2ccc(nc2)C(=O)NCc2ccc(F)cc2)n[nH]1
: