Target
Proto-oncogene tyrosine-protein kinase receptor Ret
Ligand
BDBM345840
Substrate
Meas. Tech.
RET Wild Type Assay at KM
IC50
>100±n/a nM
Citation
 Brooijmans, NDiPietro, LVFleming, PEKim, JLWenglowsky, SMZhang, Y 2-(pyridin-3-yl)-pyrimidine derivatives as RET inhibitors US Patent  US10202365 Publication Date 2/12/2019 
Target
Name:
Proto-oncogene tyrosine-protein kinase receptor Ret
Synonyms:
CDHF12 Cadherin family member 12 Proto-oncogene c-Ret RET51 Tyrosine-protein kinase Ret (RET)
Type:
Protein
Mol. Mass.:
124318.29
Organism:
Homo sapiens (Human)
Description:
P07949
Residue:
1114
  
Inhibitor
Name:
BDBM345840
Synonyms:
US10202365, Compound 17 | US10774070, Compound 17
Type:
Small organic molecule
Emp. Form.:
C26H29N7O2
Mol. Mass.:
471.5542
SMILES:
CCOc1ccc(cc1)[C@H](C)NC(=O)c1ncc(cc1C)-c1nc(C)cc(Nc2cc(C)[nH]n2)n1
: