Target
Proto-oncogene tyrosine-protein kinase receptor Ret [V804L]
Ligand
BDBM345846
Substrate
Meas. Tech.
RET V804L Gatekeeper Mutant Assay at KM
IC50
<10±n/a nM
Citation
 Brooijmans, NDiPietro, LVFleming, PEKim, JLWenglowsky, SMZhang, Y 2-(pyridin-3-yl)-pyrimidine derivatives as RET inhibitors US Patent  US10202365 Publication Date 2/12/2019 
Target
Name:
Proto-oncogene tyrosine-protein kinase receptor Ret [V804L]
Synonyms:
CDHF12 PTC RET kinase (V804L) RET51 | RET_HUMAN
Type:
Enzyme Catalytic Domain
Mol. Mass.:
124332.32
Organism:
Homo sapiens (Human)
Description:
P07949[V804L]
Residue:
1114
  
Inhibitor
Name:
BDBM345846
Synonyms:
US10202365, Compound 23 | US10774070, Compound 23
Type:
Small organic molecule
Emp. Form.:
C26H26N10O
Mol. Mass.:
494.551
SMILES:
C[C@H](NC(=O)c1ncc(cc1C)-c1nc(C)cc(Nc2cc(C)[nH]n2)n1)c1ccc(nc1)-n1cccn1
: